Reaction Details
TargetBeta-galactosidase
LigandBDBM163639
Substrate/Competitorn/a
Meas. Tech.Inhibition Assays
Ki 3.6e+4± 5e+3 nM
Citation Wallace, BDRoberts, ABPollet, RMIngle, JDBiernat, KAPellock, SJVenkatesh, MKGuthrie, LO'Neal, SKRobinson, SJDollinger, MFigueroa, EMcShane, SRCohen, RDJin, JFrye, SVZamboni, WCPepe-Ranney, CMani, SKelly, LRedinbo, MR Structure and Inhibition of Microbiome ß-Glucuronidases Essential to the Alleviation of Cancer Drug Toxicity. Chem Biol22:1238-49 (2015) 
 
Beta-galactosidase
Name:Beta-galactosidase
Synonyms:Beta-glucuronidase (SaGUS)
Type:Protein
Mol. Mass.:69235.31
Organism:Streptococcus agalactiae (Firmicutes)
Description:A0A0E1EGE5
Residue:599
BDBM163639
NameBDBM163639
TypeSmall organic molecule
Emp. Form.C23H25N3O4S
Mol. Mass.439.527
SMILESCCc1ccc2[nH]c(=O)c(CN(CCO)C(=S)Nc3ccccc3C(=O)OC)cc2c1