Reaction Details
TargetPancreatic alpha-amylase
LigandBDBM163646
Substrate/Competitorn/a
Meas. Tech.Kinetic Studies
Temperature303.15±0 K
Ki 8.1±0.8 nM
Citation Williams, LKZhang, XCaner, STysoe, CNguyen, NTWicki, JWilliams, DEColeman, JMcNeill, JHYuen, VAndersen, RJWithers, SGBrayer, GD The amylase inhibitor montbretin A reveals a new glycosidase inhibition motif. Nat Chem Biol11:691-6 (2015) 
 
Pancreatic alpha-amylase
Name:Pancreatic alpha-amylase
Type:Protein
Mol. Mass.:57709.71
Organism:Homo sapiens (Human)
Description:n/a
Residue:511
BDBM163646
NameBDBM163646
Synonyms:Montbretin A (MbA)
TypeSmall organic molecule
Emp. Form.C36H36O20
Mol. Mass.788.659
SMILESCC1O[C@@H](Oc2c(oc3cc(O)cc(O)c3c2=O)-c2cc(O)c(O)c(O)c2)[C@@H](O[C@@H]2OC(COC(=O)\C=C\c3ccc(O)c(O)c3)[C@@H](O)C(O)[C@@H]2O)C(O)[C@H]1O