Reaction Details
TargetVascular endothelial growth factor receptor 2
LigandBDBM50430875
Substrate/Competitorn/a
Meas. Tech.Inhibition Assay
pH8±n/a
IC50 4.6±n/a nM
Commentsextracted
Citation Yang, BKim, YPark, TWoo, SLee, HKim, SCho, JLee, H Anti-inflammatory compound having inhibitory activity against multiple tyrosine kinases and pharmaceutical composition containing same US Patent US9062066 Publication Date 6/23/2015
 
Vascular endothelial growth factor receptor 2
Name:Vascular endothelial growth factor receptor 2
Type:Receptor Tyrosine Kinase
Mol. Mass.:151510.97
Organism:Homo sapiens (Human)
Description:P35968
Residue:1356
BDBM50430875
NameBDBM50430875
Synonyms:CHEMBL2336005 | US9062066, LCB 03-0110
TypeSmall organic molecule
Emp. Form.C24H23N3O2S
Mol. Mass.417.523
SMILESOc1cccc(Nc2ccnc3cc(sc23)-c2cccc(CN3CCOCC3)c2)c1