Reaction Details
TargetC-C chemokine receptor type 6
LigandBDBM172369
Substrate/Competitorn/a
Meas. Tech.FLIPR Assay
IC50 1.4±n/a nM
Citation Musicki, BAubert, JBoiteaux, JClary, LRossio, PSchuppli-Nollet, M Disubstituted 3,4-diamino-3-cyclobutene-1,2-dione compounds for use in the treatment of chemokine-mediated pathologies US Patent US9090596 Publication Date 7/28/2015
 
C-C chemokine receptor type 6
Name:C-C chemokine receptor type 6
Type:Enzyme
Mol. Mass.:42510.84
Organism:Homo sapiens (Human)
Description:P51684
Residue:374
BDBM172369
NameBDBM172369
Synonyms:US9090596, 50
TypeSmall organic molecule
Emp. Form.C23H25N3O6
Mol. Mass.439.4611
SMILESCN(C)C(=O)c1cccc(Nc2c(N[C@@H](c3ccc(C)o3)C3(C)COC3)c(=O)c2=O)c1O