Reaction Details
TargetPhosphatidylinositol 4,5-bisphosphate 3-kinase catalytic subunit delta isoform
LigandBDBM150174
Substrate/Competitorn/a
Meas. Tech.Biochemical Assay
IC50 26±n/a nM
Citation Kesicki, EAFowler, KWHuang, DOoi, HCOliver, APuri, KDRuan, FTreiberg, J 5-fluoro-3-phenyl-2-[1-(9h-purin-6-ylamino)propyl]-3h-quinazolin-4-one as an inhibitor of human phosphatidylinositol 3-kinase delta US Patent US9149477 Publication Date 10/6/2015
 
Phosphatidylinositol 4,5-bisphosphate 3-kinase catalytic subunit delta isoform
Name:Phosphatidylinositol 4,5-bisphosphate 3-kinase catalytic subunit delta isoform
Type:Enzyme Subunit
Mol. Mass.:119489.41
Organism:Homo sapiens (Human)
Description:O00329
Residue:1044
BDBM150174
NameBDBM150174
Synonyms:US8980901, 93 | US9149477, Compound 93
TypeSmall organic molecule
Emp. Form.C23H19F2N7O
Mol. Mass.447.4401
SMILESCCC(Nc1ncnc2[nH]cnc12)c1nc2cccc(C)c2c(=O)n1-c1cc(F)cc(F)c1