Reaction Details
TargetTransient receptor potential cation channel subfamily V member 1
LigandBDBM185339
Substrate/Competitorn/a
Meas. Tech.pH-Based Assay
pH7.4±n/a
IC50 0.5±n/a nM
Commentsextracted
Citation Kurose, NIso, YYamaguchi, NShao, BTafesse, LZhou, XYu, J Heterocyclic compounds US Patent US9156830 Publication Date 10/13/2015
 
Transient receptor potential cation channel subfamily V member 1
Name:Transient receptor potential cation channel subfamily V member 1
Type:Protein
Mol. Mass.:94960.75
Organism:Homo sapiens (Human)
Description:Q8NER1
Residue:839
BDBM185339
NameBDBM185339
Synonyms:US9156830, I-7
TypeSmall organic molecule
Emp. Form.C24H26ClN5O2
Mol. Mass.451.949
SMILESCc1nnc(o1)-c1cnc(C2=CCN(CC2)C(=O)Nc2ccc(cc2)C(C)(C)C)c(Cl)c1