Reaction Details
TargetTyrosyl-DNA phosphodiesterase 2
LigandBDBM50438863
Substrate/Competitorn/a
Meas. Tech.Recombinant TDP2 Assay
pH7.5±n/a
IC50 1.4e+2± 3e+1 nM
Commentsextracted
Citation Marchand, CAbdelmalak, MKankanala, JHuang, SYKiselev, EFesen, KKurahashi, KSasanuma, HTakeda, SAihara, HWang, ZPommier, Y Deazaflavin Inhibitors of Tyrosyl-DNA Phosphodiesterase 2 (TDP2) Specific for the Human Enzyme and Active against Cellular TDP2. ACS Chem Biol11:1925-33 (2016) 
 
Tyrosyl-DNA phosphodiesterase 2
Name:Tyrosyl-DNA phosphodiesterase 2
Type:Enzyme Catalytic Domain
Mol. Mass.:40916.54
Organism:Homo sapiens (Human)
Description:gi_23510348
Residue:362
BDBM50438863
NameBDBM50438863
Synonyms:10-(4-Hydroxyphenyl)-2,4-dioxo-pyrimido[4,5-b]quinoline-8-carbonitrile (2) | CHEMBL2420465
TypeSmall organic molecule
Emp. Form.C18H10N4O3
Mol. Mass.330.297
SMILESOc1ccc(cc1)-n1c2cc(ccc2cc2c1nc(=O)[nH]c2=O)C#N