Reaction Details
TargetTyrosyl-DNA phosphodiesterase 2
LigandBDBM188529
Substrate/Competitorn/a
Meas. Tech.TDP2 Assays with Whole Cell Extracts
pH7.5±n/a
IC50 25±n/a nM
Commentsextracted
Citation Marchand, CAbdelmalak, MKankanala, JHuang, SYKiselev, EFesen, KKurahashi, KSasanuma, HTakeda, SAihara, HWang, ZPommier, Y Deazaflavin Inhibitors of Tyrosyl-DNA Phosphodiesterase 2 (TDP2) Specific for the Human Enzyme and Active against Cellular TDP2. ACS Chem Biol11:1925-33 (2016) 
 
Tyrosyl-DNA phosphodiesterase 2
Name:Tyrosyl-DNA phosphodiesterase 2
Type:Enzyme Catalytic Domain
Mol. Mass.:40916.54
Organism:Homo sapiens (Human)
Description:gi_23510348
Residue:362
BDBM188529
NameBDBM188529
Synonyms:2,4-Dioxo-10-[3-(1H-tetrazol-5-yl)phenyl]pyrimido[4,5-b]-quinoline-8-carbonitrile (1)
TypeSmall organic molecule
Emp. Form.C19H10N8O2
Mol. Mass.382.3351
SMILESO=c1nc2n(-c3cccc(c3)-n3cnnn3)c3cc(ccc3cc2c(=O)[nH]1)C#N