Reaction Details
TargetGag-Pol polyprotein
LigandBDBM189356
Substrate/Competitorn/a
Meas. Tech.HIV-1 RT Inhibition Assay
Temperature310.15±n/a K
IC50 1.5e+3±n/a nM
Commentsextracted
Citation Li, XHuang, BZhou, ZGao, PPannecouque, CDaelemans, DDe Clercq, EZhan, PLiu, X Arylazolyl(azinyl)thioacetanilides: Part 19: Discovery of Novel Substituted Imidazo[4,5-b]pyridin-2-ylthioacetanilides as Potent HIV NNRTIs Via a Structure-based Bioisosterism Approach. Chem Biol Drug Des88:241-53 (2016) 
 
Gag-Pol polyprotein
Name:Gag-Pol polyprotein
Type:Protein
Mol. Mass.:161820.05
Organism:Human immunodeficiency virus type 1 group M subtype B (isolate NY5) (HIV-1)
Description:P12497
Residue:1435
BDBM189356
NameBDBM189356
Synonyms:N-(2-Bromo-4-sulfonamido-phenyl)-2-(1-(4-cyclopropylnaphthalen-1-yl)-1H-imidazo[4,5-b]pyridin-2-ylthio)acetamide (12)
TypeSmall organic molecule
Emp. Form.C27H22BrN5O3S2
Mol. Mass.608.529
SMILESNS(=O)(=O)c1ccc(NC(=O)CSc2nc3ncccc3n2-c2ccc(C3CC3)c3ccccc23)c(Br)c1