Reaction Details
TargetEnoyl-[acyl-carrier-protein] reductase [NADH] [T276S]
LigandBDBM36543
Substrate/Competitorn/a
Meas. Tech.Inhibition Kinetics
IC50>1.00e+5±n/a nM
Citation Neckles, CPschibul, ALai, CTHirschbeck, MKuper, JDavoodi, SZou, JLiu, NPan, PShah, SDaryaee, FBommineni, GRLai, CSimmerling, CKisker, CTonge, PJ Selectivity of Pyridone- and Diphenyl Ether-Based Inhibitors for the Yersinia pestis FabV Enoyl-ACP Reductase. Biochemistry55:2992-3006 (2016) 
 
Enoyl-[acyl-carrier-protein] reductase [NADH] [T276S]
Name:Enoyl-[acyl-carrier-protein] reductase [NADH] [T276S]
Type:Protein
Mol. Mass.:43321.97
Organism:Yersinia pestis (Enterobacteria)
Description:B1JRQ0[T276S]
Residue:399
BDBM36543
NameBDBM36543
Synonyms:5-propyl-2-phenoxyphenol | PT02
TypeSmall organic molecule
Emp. Form.C15H16O2
Mol. Mass.228.2863
SMILESCCCc1ccc(Oc2ccccc2)c(O)c1