Reaction Details
TargetEnoyl-[acyl-carrier-protein] reductase [NADH] [T276S]
LigandBDBM190650
Substrate/Competitorn/a
Meas. Tech.Inhibition Kinetics
IC50>1.00e+5±n/a nM
Citation Neckles, CPschibul, ALai, CTHirschbeck, MKuper, JDavoodi, SZou, JLiu, NPan, PShah, SDaryaee, FBommineni, GRLai, CSimmerling, CKisker, CTonge, PJ Selectivity of Pyridone- and Diphenyl Ether-Based Inhibitors for the Yersinia pestis FabV Enoyl-ACP Reductase. Biochemistry55:2992-3006 (2016) 
 
Enoyl-[acyl-carrier-protein] reductase [NADH] [T276S]
Name:Enoyl-[acyl-carrier-protein] reductase [NADH] [T276S]
Type:Protein
Mol. Mass.:43321.97
Organism:Yersinia pestis (Enterobacteria)
Description:B1JRQ0[T276S]
Residue:399
BDBM190650
NameBDBM190650
Synonyms:LOX inhibitor, MLS000545091 | PT91
TypeSmall organic molecule
Emp. Form.C18H21ClO2
Mol. Mass.304.811
SMILESCCCCCCc1ccc(Oc2ccccc2Cl)c(O)c1