Reaction Details
TargetEnoyl-[acyl-carrier-protein] reductase [NADH] [T276S]
LigandBDBM190651
Substrate/Competitorn/a
Meas. Tech.Inhibition Kinetics
IC50 8e+3± 2e+3 nM
Citation Neckles, CPschibul, ALai, CTHirschbeck, MKuper, JDavoodi, SZou, JLiu, NPan, PShah, SDaryaee, FBommineni, GRLai, CSimmerling, CKisker, CTonge, PJ Selectivity of Pyridone- and Diphenyl Ether-Based Inhibitors for the Yersinia pestis FabV Enoyl-ACP Reductase. Biochemistry55:2992-3006 (2016) 
 
Enoyl-[acyl-carrier-protein] reductase [NADH] [T276S]
Name:Enoyl-[acyl-carrier-protein] reductase [NADH] [T276S]
Type:Protein
Mol. Mass.:43321.97
Organism:Yersinia pestis (Enterobacteria)
Description:B1JRQ0[T276S]
Residue:399
BDBM190651
NameBDBM190651
Synonyms:LOX inhibitor, 5 | PT113
TypeSmall organic molecule
Emp. Form.C18H21FO2
Mol. Mass.288.3565
SMILESCCCCCCc1ccc(Oc2ccccc2F)c(O)c1