Reaction Details
TargetBeta-secretase 1 [1-458]
LigandBDBM195061
Substrate/Competitorn/a
Meas. Tech.BACE Enzyme Assay (Ex.434)
pH4.5±n/a
Temperature298.15±n/a K
IC50 3.7±n/a nM
Commentsextracted
Citation Cacatian, SClaremon, DADillard, LWFuchs, KHeine, NJia, LLeftheris, KMcKeever, BMorales-Ramos, ASingh, SBVenkatraman, SWu, GWu, ZXu, ZYuan, JZheng, Y Inhibitors of beta-secretase US Patent US9212153 Publication Date 12/15/2015
 
Beta-secretase 1 [1-458]
Name:Beta-secretase 1 [1-458]
Type:n/a
Mol. Mass.:50753.53
Organism:Homo sapiens (Human)
Description:Truncation 1-458 aa with His-tag at C-terminus
Residue:458
BDBM195061
NameBDBM195061
Synonyms:US10336717, Compound 115 | US9212153, 115,Ex. 81
TypeSmall organic molecule
Emp. Form.C20H22F3N3O2
Mol. Mass.393.4028
SMILESCOC1CCC2(Cc3ccc(cc3C22ON(C)C(N)=N2)C#CC(F)(F)F)CC1