Reaction Details
TargetBeta-secretase 1 [1-458]
LigandBDBM195181
Substrate/Competitorn/a
Meas. Tech.BACE Enzyme Assay (Ex.435)
pH4.4±n/a
IC50 3.5±n/a nM
Commentsextracted
Citation Cacatian, SClaremon, DADillard, LWFuchs, KHeine, NJia, LLeftheris, KMcKeever, BMorales-Ramos, ASingh, SBVenkatraman, SWu, GWu, ZXu, ZYuan, JZheng, Y Inhibitors of beta-secretase US Patent US9212153 Publication Date 12/15/2015
 
Beta-secretase 1 [1-458]
Name:Beta-secretase 1 [1-458]
Type:n/a
Mol. Mass.:50753.53
Organism:Homo sapiens (Human)
Description:Truncation 1-458 aa with His-tag at C-terminus
Residue:458
BDBM195181
NameBDBM195181
Synonyms:US10336717, Compound 244 | US9212153, 244,Ex. 199
TypeSmall organic molecule
Emp. Form.C22H29N3O3
Mol. Mass.383.484
SMILESCOC1CCC2(Cc3ccc(OCC4CC4)cc3C22N=C(N)N(C)C2=O)CC1