Reaction Details
TargetHistone deacetylase 6
LigandBDBM197336
Substrate/Competitorn/a
Meas. Tech.HDAC activity assays
IC50 4.67±0.06 nM
Citation Miyake, YKeusch, JJWang, LSaito, MHess, DWang, XMelancon, BJHelquist, PGut, HMatthias, P Structural insights into HDAC6 tubulin deacetylation and its selective inhibition. Nat Chem Biol12:748-54 (2016) 
 
Histone deacetylase 6
Name:Histone deacetylase 6
Type:Chromatin regulator; hydrolase; repressor
Mol. Mass.:131381.51
Organism:Homo sapiens (Human)
Description:Q9UBN7
Residue:1215
BDBM197336
NameBDBM197336
Synonyms:R-TSA
TypeSmall organic molecule
Emp. Form.C17H22N2O3
Mol. Mass.302.3682
SMILESC[C@H](\C=C\C(=O)NO)\C=C(/C)C(=O)c1ccc(cc1)N(C)C