Reaction Details
TargetD(3) dopamine receptor
LigandBDBM21397
Substrate/Competitorn/a
Meas. Tech.Competitive Binding Assays
Ki 0.48±0.07 nM
Citation Li, WZhang, LXu, LYuan, CDu, PChen, JZhen, XFu, W Functional reversal of (-)-Stepholidine analogues by replacement of benzazepine substructure using the ring-expansion strategy. Chem Biol Drug Des88:599-607 (2016) 
 
D(3) dopamine receptor
Name:D(3) dopamine receptor
Type:n/a
Mol. Mass.:44243.43
Organism:Homo sapiens (Human)
Description:n/a
Residue:400
BDBM21397
NameBDBM21397
Synonyms:8-[4-(4-fluorophenyl)-4-keto-butyl]-1-phenyl-1,3,8-triazaspiro[4.5]decan-4-one 8-[4-(4-fluorophenyl)-4-oxobutyl]-1-phenyl-1,3,8-triazaspiro[4.5]decan-4-one MLS000028615 SPIPERONE US9359372, Spiperone cid_5265
Typeradiolabeled ligand
Emp. Form.C23H26FN3O2
Mol. Mass.395.4698
SMILESFc1ccc(cc1)C(=O)CCCN1CCC2(CC1)N(CNC2=O)c1ccccc1