Reaction Details
TargetPotassium channel subfamily K member 2
LigandBDBM60939
Substrate/Competitorn/a
Meas. Tech.TREK1 Assay
pH7.3±n/a
Temperature295.15±n/a K
EC50 60±n/a nM
Commentsextracted
Citation Viswanath, ANJung, SYHwang, EMPark, KDLim, SMMin, SJCho, YSPae, AN Identification of the first in silico-designed TREK1 antagonists that block channel currents dose dependently. Chem Biol Drug Des88:807-819 (2016) 
 
Potassium channel subfamily K member 2
Name:Potassium channel subfamily K member 2
Type:Protein
Mol. Mass.:47099.16
Organism:Homo sapiens (Human)
Description:O95069
Residue:426
BDBM60939
NameBDBM60939
Synonyms:I-NBP
Typen/a
Emp. Form.C12H14O2
Mol. Mass.190.2384
SMILESCCCC[C@H]1OC(=O)c2ccccc12