Reaction Details
TargetPotassium channel subfamily K member 2
LigandBDBM190405
Substrate/Competitorn/a
Meas. Tech.TREK1 Assay
pH7.3±n/a
Temperature295.15±n/a K
EC50 24100±n/a nM
Commentsextracted
Citation Viswanath, ANJung, SYHwang, EMPark, KDLim, SMMin, SJCho, YSPae, AN Identification of the first in silico-designed TREK1 antagonists that block channel currents dose dependently. Chem Biol Drug Des88:807-819 (2016) 
 
Potassium channel subfamily K member 2
Name:Potassium channel subfamily K member 2
Type:Protein
Mol. Mass.:47099.16
Organism:Homo sapiens (Human)
Description:O95069
Residue:426
BDBM190405
NameBDBM190405
Synonyms:US9180183, Quinidine
TypeSmall organic molecule
Emp. Form.C20H24N2O2
Mol. Mass.324.4168
SMILESCOc1ccc2nccc([C@H](O)C3CC4CCN3C[C@@H]4C=C)c2c1