Reaction Details
TargetComplement factor D [24-253]
LigandBDBM203865
Substrate/Competitorn/a
Meas. Tech.Complement FD Thioesterolysis Assay
pH7.5±n/a
Temperature298.15±n/a K
IC50 1.37e+4± 8.7e+3 nM
Commentsextracted
Citation Maibaum, JLiao, SMVulpetti, AOstermann, NRandl, SRüdisser, SLorthiois, EErbel, PKinzel, BKolb, FABarbieri, SWagner, JDurand, CFettis, KDussauge, SHughes, NDelgado, OHommel, UGould, TMac Sweeney, AGerhartz, BCumin, FFlohr, SSchubart, AJaffee, BHarrison, RRisitano, AMEder, JAnderson, K Small-molecule factor D inhibitors targeting the alternative complement pathway. Nat Chem Biol12:1105-1110 (2016) 
 
Complement factor D [24-253]
Name:Complement factor D [24-253]
Type:Protein
Mol. Mass.:24622.79
Organism:Homo sapiens (Human)
Description:P00746 (24-253 aa)
Residue:230
BDBM203865
NameBDBM203865
Synonyms:Methyl (S)-2-((2-((3-(trifluoromethoxy)phenyl)carbamoyl)pyrrolidine-1-carboxamido)-methyl)benzoate (2)
TypeSmall organic molecule
Emp. Form.C22H22F3N3O5
Mol. Mass.465.4224
SMILESCOC(=O)c1ccccc1CNC(=O)N1CCC[C@H]1C(=O)Nc1cccc(OC(F)(F)F)c1