Reaction Details
TargetKallikrein-7 [37-253,Y180R]
LigandBDBM171272
Substrate/Competitorn/a
Meas. Tech.Human KLK7 Fluorescence-Lifetime Assay
pH5.6±n/a
Temperature298.15±n/a K
IC50>1.00e+5±n/a nM
Commentsextracted
Citation Maibaum, JLiao, SMVulpetti, AOstermann, NRandl, SRüdisser, SLorthiois, EErbel, PKinzel, BKolb, FABarbieri, SWagner, JDurand, CFettis, KDussauge, SHughes, NDelgado, OHommel, UGould, TMac Sweeney, AGerhartz, BCumin, FFlohr, SSchubart, AJaffee, BHarrison, RRisitano, AMEder, JAnderson, K Small-molecule factor D inhibitors targeting the alternative complement pathway. Nat Chem Biol12:1105-1110 (2016) 
 
Kallikrein-7 [37-253,Y180R]
Name:Kallikrein-7 [37-253,Y180R]
Type:Protein
Mol. Mass.:23785.70
Organism:Homo sapiens (Human)
Description:P49862 (37-253 aa with Y180R mutation)
Residue:217
BDBM171272
NameBDBM171272
Synonyms:1-(2-((1R,3S,5R)-3-(((R)-1-(3-Chloro-2-fluorophenyl)ethyl)carbamoyl)-2-azabicyclo[3.1.0]hexan-2-yl)-2-oxoethyl)-1H-pyrazolo[3,4-c]pyridine-3-carboxamide (6) | US9085555, 702
TypeSmall organic molecule
Emp. Form.C23H22ClFN6O3
Mol. Mass.484.911
SMILESC[C@@H](NC(=O)[C@@H]1C[C@H]2C[C@H]2N1C(=O)Cn1nc(C(N)=O)c2ccncc12)c1cccc(Cl)c1F