Reaction Details
TargetComplement factor D [24-253]
LigandBDBM171272
Substrate/Competitorn/a
Meas. Tech.SPR Binding Affinity Assay (Single Cycle)
pH7.4±n/a
Temperature298.15±n/a K
Kd 6.03±0.68 nM
Commentsextracted
Citation Maibaum, JLiao, SMVulpetti, AOstermann, NRandl, SRüdisser, SLorthiois, EErbel, PKinzel, BKolb, FABarbieri, SWagner, JDurand, CFettis, KDussauge, SHughes, NDelgado, OHommel, UGould, TMac Sweeney, AGerhartz, BCumin, FFlohr, SSchubart, AJaffee, BHarrison, RRisitano, AMEder, JAnderson, K Small-molecule factor D inhibitors targeting the alternative complement pathway. Nat Chem Biol12:1105-1110 (2016) 
 
Complement factor D [24-253]
Name:Complement factor D [24-253]
Type:Protein
Mol. Mass.:24622.79
Organism:Homo sapiens (Human)
Description:P00746 (24-253 aa)
Residue:230
BDBM171272
NameBDBM171272
Synonyms:1-(2-((1R,3S,5R)-3-(((R)-1-(3-Chloro-2-fluorophenyl)ethyl)carbamoyl)-2-azabicyclo[3.1.0]hexan-2-yl)-2-oxoethyl)-1H-pyrazolo[3,4-c]pyridine-3-carboxamide (6) | US9085555, 702
TypeSmall organic molecule
Emp. Form.C23H22ClFN6O3
Mol. Mass.484.911
SMILESC[C@@H](NC(=O)[C@@H]1C[C@H]2C[C@H]2N1C(=O)Cn1nc(C(N)=O)c2ccncc12)c1cccc(Cl)c1F