Reaction Details
TargetInduced myeloid leukemia cell differentiation protein Mcl-1 [171-327]
LigandBDBM203872
Substrate/Competitorn/a
Meas. Tech.TR-FRET Binding A
pH7.4±n/a
Temperature297.15±n/a K
Ki 64±0 nM
IC50 237±28 nM
Commentsextracted
Citation Akçay, GBelmonte, MAAquila, BChuaqui, CHird, AWLamb, MLRawlins, PBSu, NTentarelli, SGrimster, NPSu, Q Inhibition of Mcl-1 through covalent modification of a noncatalytic lysine side chain. Nat Chem Biol12:931-936 (2016) 
 
Induced myeloid leukemia cell differentiation protein Mcl-1 [171-327]
Name:Induced myeloid leukemia cell differentiation protein Mcl-1 [171-327]
Type:Enzyme Catalytic Domain
Mol. Mass.:17896.13
Organism:Homo sapiens (Human)
Description:Q07820[171-327]
Residue:157
BDBM203872
NameBDBM203872
Synonyms:7-(3-((3-Acetylphenoxy)methyl)-1,5-dimethyl-1H-pyrazol-4-yl)-3-(3-(naphthalen-1-yloxy)propyl)-1H-indole-2-carboxylic acid, 8 | Mcl-1 inhibitor 8
TypeSmall organic molecule
Emp. Form.C36H33N3O5
Mol. Mass.587.6643
SMILESCC(=O)c1cccc(OCc2nn(C)c(C)c2-c2cccc3c(CCCOc4cccc5ccccc45)c([nH]c23)C(O)=O)c1