Reaction Details
TargetInduced myeloid leukemia cell differentiation protein Mcl-1 [171-327]
LigandBDBM203875
Substrate/Competitorn/a
Meas. Tech.TR-FRET Binding A
pH7.4±n/a
Temperature297.15±n/a K
Ki 1.2±0 nM
IC50 4.2±0.2 nM
Commentsextracted
Citation Akçay, GBelmonte, MAAquila, BChuaqui, CHird, AWLamb, MLRawlins, PBSu, NTentarelli, SGrimster, NPSu, Q Inhibition of Mcl-1 through covalent modification of a noncatalytic lysine side chain. Nat Chem Biol12:931-936 (2016) 
 
Induced myeloid leukemia cell differentiation protein Mcl-1 [171-327]
Name:Induced myeloid leukemia cell differentiation protein Mcl-1 [171-327]
Type:Enzyme Catalytic Domain
Mol. Mass.:17896.13
Organism:Homo sapiens (Human)
Description:Q07820[171-327]
Residue:157
BDBM203875
NameBDBM203875
Synonyms:7-(3-((4-Borono-3-formylphenoxy)methyl)-1,5-dimethyl-1Hpyrazol-4-yl)-1-methyl-3-(3-(naphthalen-1-yloxy)propyl)-1H-indole-2-carboxylic acid, 11 | Mcl-1 inhibitor 11
TypeSmall organic molecule
Emp. Form.C36H34BN3O7
Mol. Mass.631.482
SMILESCc1c(c(COc2ccc(B(O)O)c(C=O)c2)nn1C)-c1cccc2c(CCCOc3cccc4ccccc34)c(C(O)=O)n(C)c12