Reaction Details
TargetInduced myeloid leukemia cell differentiation protein Mcl-1 [171-327]
LigandBDBM203876
Substrate/Competitorn/a
Meas. Tech.TR-FRET Binding A
pH7.4±n/a
Temperature297.15±n/a K
Ki 1.6±0 nM
IC50 5.96±0.35 nM
Commentsextracted
Citation Akçay, GBelmonte, MAAquila, BChuaqui, CHird, AWLamb, MLRawlins, PBSu, NTentarelli, SGrimster, NPSu, Q Inhibition of Mcl-1 through covalent modification of a noncatalytic lysine side chain. Nat Chem Biol12:931-936 (2016) 
 
Induced myeloid leukemia cell differentiation protein Mcl-1 [171-327]
Name:Induced myeloid leukemia cell differentiation protein Mcl-1 [171-327]
Type:Enzyme Catalytic Domain
Mol. Mass.:17896.13
Organism:Homo sapiens (Human)
Description:Q07820[171-327]
Residue:157
BDBM203876
NameBDBM203876
Synonyms:Mcl-1 inhibitor 12
TypeSmall organic molecule
Emp. Form.C36H42N4O4
Mol. Mass.594.7431
SMILESCCc1nn(C)c(CC)c1-c1cccc2c(CCCOc3cccc4ccccc34)c(C(O)=O)n(CCN3CCOCC3)c12