Reaction Details
TargetProstaglandin G/H synthase 2 [18-604,S516A]
LigandBDBM17638
Substrate/Competitorn/a
Meas. Tech.COX Enzyme Inhibition Assay (Table 2)
IC50 2.2e+2±n/a nM
Citation Uddin, MJCrews, BCXu, SGhebreselasie, KDaniel, CKKingsley, PJBanerjee, SMarnett, LJ Antitumor Activity of Cytotoxic Cyclooxygenase-2 Inhibitors. ACS Chem Biol11:3052-3060 (2016) 
 
Prostaglandin G/H synthase 2 [18-604,S516A]
Name:Prostaglandin G/H synthase 2 [18-604,S516A]
Type:Protein
Mol. Mass.:67244.20
Organism:Mus musculus (Mouse)
Description:Sequence based on 4OTJ
Residue:587
BDBM17638
NameBDBM17638
Synonyms:2-{1-[(4-chlorophenyl)carbonyl]-5-methoxy-2-methyl-1H-indol-3-yl}acetic acid Indocin US11478464, Compound Indomethacin US9271961, Indomethacin | indometacin
TypeSmall organic molecule
Emp. Form.C19H16ClNO4
Mol. Mass.357.788
SMILESCOc1ccc2n(C(=O)c3ccc(Cl)cc3)c(C)c(CC(O)=O)c2c1