Reaction Details
TargetEphrin type-A receptor 2 [596-900]
LigandBDBM50399540
Substrate/Competitorn/a
Meas. Tech.Kinobeads Competition Assay
Kd 52±0.0 nM
Citation Heinzlmeir, SKudlinzki, DSreeramulu, SKlaeger, SGande, SLLinhard, VWilhelm, MQiao, HHelm, DRuprecht, BSaxena, KMédard, GSchwalbe, HKuster, B Chemical Proteomics and Structural Biology Define EPHA2 Inhibition by Clinical Kinase Drugs. ACS Chem Biol11:3400-3411 (2016) 
 
Ephrin type-A receptor 2 [596-900]
Name:Ephrin type-A receptor 2 [596-900]
Type:Protein
Mol. Mass.:34367.96
Organism:Homo sapiens (Human)
Description:EPHA2 truncation (596-900 aa); 519U
Residue:305
BDBM50399540
NameBDBM50399540
Synonyms:FORETINIB US10882853, Compound For-Oxide
TypeSmall organic molecule
Emp. Form.C34H34F2N4O6
Mol. Mass.632.6538
SMILESCOc1cc2c(Oc3ccc(NC(=O)C4(CC4)C(=O)Nc4ccc(F)cc4)cc3F)ccnc2cc1OCCCN1CCOCC1