Reaction Details
TargetEphrin type-A receptor 2 [596-900]
LigandBDBM50331095
Substrate/Competitorn/a
Meas. Tech.Kinobeads Competition Assay
Kd 259±0.0 nM
Citation Heinzlmeir, SKudlinzki, DSreeramulu, SKlaeger, SGande, SLLinhard, VWilhelm, MQiao, HHelm, DRuprecht, BSaxena, KMédard, GSchwalbe, HKuster, B Chemical Proteomics and Structural Biology Define EPHA2 Inhibition by Clinical Kinase Drugs. ACS Chem Biol11:3400-3411 (2016) 
 
Ephrin type-A receptor 2 [596-900]
Name:Ephrin type-A receptor 2 [596-900]
Type:Protein
Mol. Mass.:34367.96
Organism:Homo sapiens (Human)
Description:EPHA2 truncation (596-900 aa); 519U
Residue:305
BDBM50331095
NameBDBM50331095
Synonyms:CHEMBL1289494 US10464902, Tivozanib
TypeSmall organic molecule
Emp. Form.C22H19ClN4O5
Mol. Mass.454.863
SMILESCOc1cc2nccc(Oc3ccc(NC(=O)Nc4cc(C)on4)c(Cl)c3)c2cc1OC