Reaction Details
TargetEphrin type-A receptor 2 [596-900]
LigandBDBM12255
Substrate/Competitorn/a
Meas. Tech.Kinobeads Competition Assay
Kd 338±0.0 nM
Citation Heinzlmeir, SKudlinzki, DSreeramulu, SKlaeger, SGande, SLLinhard, VWilhelm, MQiao, HHelm, DRuprecht, BSaxena, KMédard, GSchwalbe, HKuster, B Chemical Proteomics and Structural Biology Define EPHA2 Inhibition by Clinical Kinase Drugs. ACS Chem Biol11:3400-3411 (2016) 
 
Ephrin type-A receptor 2 [596-900]
Name:Ephrin type-A receptor 2 [596-900]
Type:Protein
Mol. Mass.:34367.96
Organism:Homo sapiens (Human)
Description:EPHA2 truncation (596-900 aa); 519U
Residue:305
BDBM12255
NameBDBM12255
Synonyms:AZD0530 Compound 33 Saracatinib | med.21724, Compound 189
TypeSmall organic molecule
Emp. Form.C27H32ClN5O5
Mol. Mass.542.026
SMILESCN1CCN(CCOc2cc(OC3CCOCC3)c3c(Nc4c5OCOc5ccc4Cl)ncnc3c2)CC1