Reaction Details
TargetCannabinoid receptor 2
LigandBDBM210608
Substrate/Competitorn/a
Meas. Tech.cAMP Assay
Temperature310.15±n/a K
EC50 962.4±n/a nM
Commentsextracted
Citation Bissantz, CGrether, UHebeisen, PKimbara, ALiu, QNettekoven, MPrunotto, MRoever, SRogers-Evans, MSchulz-Gasch, TUllmer, CWang, ZYang, W Pyridine derivatives as agonists of the CB2 receptor US Patent US9290451 Publication Date 3/22/2016
 
Cannabinoid receptor 2
Name:Cannabinoid receptor 2
Type:G Protein-Coupled Receptor (GPCR)
Mol. Mass.:39690.94
Organism:Homo sapiens (Human)
Description:P34972
Residue:360
BDBM210608
NameBDBM210608
Synonyms:US9290451, 297
TypeSmall organic molecule
Emp. Form.C16H20F5N3O3
Mol. Mass.397.3403
SMILESCCC(CC)(NC(=O)c1cccc(OCC(F)(F)C(F)(F)F)n1)C(=O)NC