Reaction Details
TargetCannabinoid receptor 1
LigandBDBM210600
Substrate/Competitorn/a
Meas. Tech.cAMP Assay
Temperature310.15±n/a K
EC50>10000±n/a nM
Commentsextracted
Citation Bissantz, CGrether, UHebeisen, PKimbara, ALiu, QNettekoven, MPrunotto, MRoever, SRogers-Evans, MSchulz-Gasch, TUllmer, CWang, ZYang, W Pyridine derivatives as agonists of the CB2 receptor US Patent US9290451 Publication Date 3/22/2016
 
Cannabinoid receptor 1
Name:Cannabinoid receptor 1
Type:G Protein-Coupled Receptor (GPCR)
Mol. Mass.:52868.96
Organism:Homo sapiens (Human)
Description:P21554
Residue:472
BDBM210600
NameBDBM210600
Synonyms:US9290451, 291
TypeSmall organic molecule
Emp. Form.C20H29N3O4
Mol. Mass.375.462
SMILESCCC(CC)(NC(=O)c1ccc(N2CCCC2)c(OCC2CC2)n1)C(O)=O