Reaction Details
TargetCannabinoid receptor 1
LigandBDBM210646
Substrate/Competitorn/a
Meas. Tech.cAMP Assay
Temperature310.15±n/a K
EC50>10000±n/a nM
Commentsextracted
Citation Bissantz, CGrether, UHebeisen, PKimbara, ALiu, QNettekoven, MPrunotto, MRoever, SRogers-Evans, MSchulz-Gasch, TUllmer, CWang, ZYang, W Pyridine derivatives as agonists of the CB2 receptor US Patent US9290451 Publication Date 3/22/2016
 
Cannabinoid receptor 1
Name:Cannabinoid receptor 1
Type:G Protein-Coupled Receptor (GPCR)
Mol. Mass.:52868.96
Organism:Homo sapiens (Human)
Description:P21554
Residue:472
BDBM210646
NameBDBM210646
Synonyms:US9290451, 319
TypeSmall organic molecule
Emp. Form.C20H28F3N3O4
Mol. Mass.431.4492
SMILESCCC(CC)(NC(=O)c1ccc(C2CC2)c(O[C@@H](CCO)C(F)(F)F)n1)C(=O)NC