Reaction Details
TargetCannabinoid receptor 1
LigandBDBM210662
Substrate/Competitorn/a
Meas. Tech.cAMP Assay
Temperature310.15±n/a K
EC50>10000±n/a nM
Commentsextracted
Citation Bissantz, CGrether, UHebeisen, PKimbara, ALiu, QNettekoven, MPrunotto, MRoever, SRogers-Evans, MSchulz-Gasch, TUllmer, CWang, ZYang, W Pyridine derivatives as agonists of the CB2 receptor US Patent US9290451 Publication Date 3/22/2016
 
Cannabinoid receptor 1
Name:Cannabinoid receptor 1
Type:G Protein-Coupled Receptor (GPCR)
Mol. Mass.:52868.96
Organism:Homo sapiens (Human)
Description:P21554
Residue:472
BDBM210662
NameBDBM210662
Synonyms:US9290451, 330
TypeSmall organic molecule
Emp. Form.C16H25N3O4S
Mol. Mass.355.452
SMILESCC(C)C[C@H](NC(=O)c1cccc(n1)S(=O)(=O)CC(C)C)C(N)=O