Reaction Details
TargetPlasma kallikrein
LigandBDBM212109
Substrate/Competitorn/a
Meas. Tech.In-vitro Plasma Kallikrein Inhibition
pH7.8±n/a
Temperature298.15±n/a K
IC50 1.2±n/a nM
Commentsextracted
Citation Brandl, TFlohr, SKopec, SLachal, JMarkert, CNamoto, KNganga, PPirard, BRenatus, MSedrani, RZoller, T N-((6-amino-pyridin-3-yl)methyl)-heteroaryl-carboxamides US Patent US9290485 Publication Date 3/22/2016
 
Plasma kallikrein
Name:Plasma kallikrein
Type:Protein
Mol. Mass.:71391.16
Organism:Homo sapiens (Human)
Description:P03952
Residue:638
BDBM212109
NameBDBM212109
Synonyms:US9290485, 141
TypeSmall organic molecule
Emp. Form.C25H29N7O2
Mol. Mass.459.5435
SMILESCc1cc(=O)n(C)n1Cc1ccc(Cn2cc(cn2)C(=O)NCc2c(C)cc(N)nc2C)cc1