Reaction Details
TargetPlasma kallikrein
LigandBDBM212111
Substrate/Competitorn/a
Meas. Tech.In-vitro Plasma Kallikrein Inhibition
pH7.8±n/a
Temperature298.15±n/a K
IC50 2.6±n/a nM
Commentsextracted
Citation Brandl, TFlohr, SKopec, SLachal, JMarkert, CNamoto, KNganga, PPirard, BRenatus, MSedrani, RZoller, T N-((6-amino-pyridin-3-yl)methyl)-heteroaryl-carboxamides US Patent US9290485 Publication Date 3/22/2016
 
Plasma kallikrein
Name:Plasma kallikrein
Type:Protein
Mol. Mass.:71391.16
Organism:Homo sapiens (Human)
Description:P03952
Residue:638
BDBM212111
NameBDBM212111
Synonyms:US9290485, 143
TypeSmall organic molecule
Emp. Form.C24H28N6O2
Mol. Mass.432.5181
SMILESCc1cc(N)nc(C)c1CNC(=O)c1cnn(Cc2ccc(CN3CCCC3=O)cc2)c1