Reaction Details
TargetPlasma kallikrein
LigandBDBM212122
Substrate/Competitorn/a
Meas. Tech.In-vitro Plasma Kallikrein Inhibition
pH7.8±n/a
Temperature298.15±n/a K
IC50 2±n/a nM
Commentsextracted
Citation Brandl, TFlohr, SKopec, SLachal, JMarkert, CNamoto, KNganga, PPirard, BRenatus, MSedrani, RZoller, T N-((6-amino-pyridin-3-yl)methyl)-heteroaryl-carboxamides US Patent US9290485 Publication Date 3/22/2016
 
Plasma kallikrein
Name:Plasma kallikrein
Type:Protein
Mol. Mass.:71391.16
Organism:Homo sapiens (Human)
Description:P03952
Residue:638
BDBM212122
NameBDBM212122
Synonyms:US9290485, 154
TypeSmall organic molecule
Emp. Form.C23H24N6O
Mol. Mass.400.4763
SMILESCc1ccc2cc(Cn3cc(cn3)C(=O)NCc3c(C)cc(N)nc3C)ccc2n1