Reaction Details
TargetPlasma kallikrein
LigandBDBM212123
Substrate/Competitorn/a
Meas. Tech.In-vitro Plasma Kallikrein Inhibition
pH7.8±n/a
Temperature298.15±n/a K
IC50 3±n/a nM
Commentsextracted
Citation Brandl, TFlohr, SKopec, SLachal, JMarkert, CNamoto, KNganga, PPirard, BRenatus, MSedrani, RZoller, T N-((6-amino-pyridin-3-yl)methyl)-heteroaryl-carboxamides US Patent US9290485 Publication Date 3/22/2016
 
Plasma kallikrein
Name:Plasma kallikrein
Type:Protein
Mol. Mass.:71391.16
Organism:Homo sapiens (Human)
Description:P03952
Residue:638
BDBM212123
NameBDBM212123
Synonyms:US9290485, 155
TypeSmall organic molecule
Emp. Form.C22H22N6O
Mol. Mass.386.4497
SMILESCc1cc(N)nc(C)c1CNC(=O)c1cnn(Cc2cnc3ccccc3c2)c1