Reaction Details
TargetPlasma kallikrein
LigandBDBM212125
Substrate/Competitorn/a
Meas. Tech.In-vitro Plasma Kallikrein Inhibition
pH7.8±n/a
Temperature298.15±n/a K
IC50 2±n/a nM
Commentsextracted
Citation Brandl, TFlohr, SKopec, SLachal, JMarkert, CNamoto, KNganga, PPirard, BRenatus, MSedrani, RZoller, T N-((6-amino-pyridin-3-yl)methyl)-heteroaryl-carboxamides US Patent US9290485 Publication Date 3/22/2016
 
Plasma kallikrein
Name:Plasma kallikrein
Type:Protein
Mol. Mass.:71391.16
Organism:Homo sapiens (Human)
Description:P03952
Residue:638
BDBM212125
NameBDBM212125
Synonyms:US9290485, 157
TypeSmall organic molecule
Emp. Form.C22H21ClN6O
Mol. Mass.420.895
SMILESCc1cc(N)nc(C)c1CNC(=O)c1cnn(Cc2ccc3ccc(Cl)cc3n2)c1