Reaction Details
TargetPlasma kallikrein
LigandBDBM212126
Substrate/Competitorn/a
Meas. Tech.In-vitro Plasma Kallikrein Inhibition
pH7.8±n/a
Temperature298.15±n/a K
IC50 4±n/a nM
Commentsextracted
Citation Brandl, TFlohr, SKopec, SLachal, JMarkert, CNamoto, KNganga, PPirard, BRenatus, MSedrani, RZoller, T N-((6-amino-pyridin-3-yl)methyl)-heteroaryl-carboxamides US Patent US9290485 Publication Date 3/22/2016
 
Plasma kallikrein
Name:Plasma kallikrein
Type:Protein
Mol. Mass.:71391.16
Organism:Homo sapiens (Human)
Description:P03952
Residue:638
BDBM212126
NameBDBM212126
Synonyms:US9290485, 158
TypeSmall organic molecule
Emp. Form.C21H20ClN7O
Mol. Mass.421.883
SMILESCc1cc(N)nc(C)c1CNC(=O)c1cn(Cc2ccc3ccc(Cl)cc3n2)nn1