Reaction Details
TargetPlasma kallikrein
LigandBDBM212133
Substrate/Competitorn/a
Meas. Tech.In-vitro Plasma Kallikrein Inhibition
pH7.8±n/a
Temperature298.15±n/a K
IC50 6±n/a nM
Commentsextracted
Citation Brandl, TFlohr, SKopec, SLachal, JMarkert, CNamoto, KNganga, PPirard, BRenatus, MSedrani, RZoller, T N-((6-amino-pyridin-3-yl)methyl)-heteroaryl-carboxamides US Patent US9290485 Publication Date 3/22/2016
 
Plasma kallikrein
Name:Plasma kallikrein
Type:Protein
Mol. Mass.:71391.16
Organism:Homo sapiens (Human)
Description:P03952
Residue:638
BDBM212133
NameBDBM212133
Synonyms:US9290485, 165
TypeSmall organic molecule
Emp. Form.C22H25N7O
Mol. Mass.403.4802
SMILESCc1nc2cc(Cn3cc(cn3)C(=O)NCc3c(C)cc(N)nc3C)ccc2n1C