Reaction Details
TargetHistone deacetylase 5
LigandBDBM50005711
Substrate/Competitorn/a
Meas. Tech.HDAC Cell-Free Assays
pH8±n/a
IC50 1.48e+3±n/a nM
Commentsextracted
Citation Cao, BLi, JZhu, JShen, MHan, KZhang, ZYu, YWang, YWu, DChen, SSun, ATang, XZhao, YQiao, CHou, TMao, X The antiparasitic clioquinol induces apoptosis in leukemia and myeloma cells by inhibiting histone deacetylase activity. J Biol Chem288:34181-9 (2013) 
 
Histone deacetylase 5
Name:Histone deacetylase 5
Type:Enzyme
Mol. Mass.:121968.61
Organism:Homo sapiens (Human)
Description:Q9UQL6
Residue:1122
BDBM50005711
NameBDBM50005711
Synonyms:CHEBI:46024 TRICHOSTATIN Trichostatin A (TSA) US10722597, Compound Trichostatin US20230322747, Compound trichostatin A | US9265734, TSA
TypeSmall organic molecule
Emp. Form.C17H22N2O3
Mol. Mass.302.3682
SMILESC[C@H](\C=C(/C)\C=C\C(=O)NO)C(=O)c1ccc(cc1)N(C)C