Reaction Details
TargetBeta-secretase 1
LigandBDBM50432601
Substrate/Competitorn/a
Meas. Tech.In Vitro BACE Cell-Based Assay
Temperature310.15±n/a K
IC50 2820±n/a nM
Commentsextracted
Citation Minatti, AELow, JDAllen, JRChen, JChen, NCheng, YJudd, TLiu, QLopez, PQian, WRumfelt, SRzasa, RMTamayo, NAXue, QYang, BZhong, W Perfluorinated 5,6-dihydro-4H-1,3-oxazin-2-amine compounds as beta-secretase inhibitors and methods of use US Patent US9296734 Publication Date 3/29/2016
 
Beta-secretase 1
Name:Beta-secretase 1
Type:Protein
Mol. Mass.:55755.10
Organism:Homo sapiens (Human)
Description:P56817
Residue:501
BDBM50432601
NameBDBM50432601
Synonyms:CHEMBL2347208 | US9296734, 102
TypeSmall organic molecule
Emp. Form.C19H15F4N5O2
Mol. Mass.421.3483
SMILESC[C@]1(C[C@H](OC(N)=N1)C(F)(F)F)c1cc(NC(=O)c2ccc(cn2)C#N)ccc1F