Reaction Details
TargetCystic fibrosis transmembrane conductance regulator
LigandBDBM221935
Substrate/Competitorn/a
Meas. Tech.IonWorks Quattro Assay
IC50>30±n/a nM
Citation Ahmed, MAshall-Kelly, ABloomfield, GCGueritz, LMcKenna, JMcKenna, JMutton, SParmar, RSheperd, JWright, P Substituted pyrazino[1′,2′:1,2]pyrrolo[3,4-d]pyrimidines, pyrimido[4′,5′:3,4]pyrrolo[2,1-c][1,4]oxazines and pyrimido[4′,5′:3,4]pyrrolo[1,2-d][1,4]oxazepines for inhibiting the CFTR channel US Patent US9303035 Publication Date 4/5/2016
 
Cystic fibrosis transmembrane conductance regulator
Name:Cystic fibrosis transmembrane conductance regulator
Synonyms:cystic fibrosis transmembrane conductance regulator protein (CFTR)
Type:Protein
Mol. Mass.:125499.86
Organism:Cricetulus griseus (Chinese hamster)
Description:G3H9J3
Residue:1107
BDBM221935
NameBDBM221935
Synonyms:US9303035, 1.3
TypeSmall organic molecule
Emp. Form.C22H22N4O3
Mol. Mass.390.4351
SMILESCc1ccc(o1)[C@H]1NCCn2c1c1n(C)c(=O)n(C)c(=O)c1c2-c1ccccc1