Reaction Details
TargetALK tyrosine kinase/Hepatocyte growth factor receptor
LigandBDBM222078
Substrate/Competitorn/a
Meas. Tech.In Vitro c-Met Enzyme Assay
IC50 1.134e+4± 1.45e+3 nM
Citation Yang, YZhang, YYang, LZhao, LSi, LZhang, HLiu, QZhou, J Discovery of imidazopyridine derivatives as novel c-Met kinase inhibitors: Synthesis, SAR study, and biological activity. Bioorg Chem70:126-132 (2017) 
 
ALK tyrosine kinase/Hepatocyte growth factor receptor
Name:ALK tyrosine kinase/Hepatocyte growth factor receptor
Synonyms:c-Met/ALK
Type:Protein
Mol. Mass.:n/a
Description:n/a
Components:This complex has 2 components.
Component 1
Name:Hepatocyte growth factor receptor
Type:Protein
Mol. Mass.:155559.73
Organism:Homo sapiens (Human)
Description:P08581
Residue:1390
Component 2
Name:ALK tyrosine kinase receptor
Synonyms:ALK ALK_HUMAN CD_antigen: CD246
Type:Protein
Mol. Mass.:176453.10
Organism:Homo sapiens (Human)
Description:Q9UM73
Residue:1620
BDBM222078
NameBDBM222078
Synonyms:6-Chloro-3-((2-(2,4-dichlorophenyl)imidazo[1,2-a]pyridin-8-yl)methoxy)-[1,2,4]triazolo[4,3-b] pyridazine (7g)
TypeSmall organic molecule
Emp. Form.C19H11Cl3N6O
Mol. Mass.445.689
SMILESClc1ccc(-c2cn3cccc(COc4nnc5ccc(Cl)nn45)c3n2)c(Cl)c1