Reaction Details
TargetIsoform 1 of Metabotropic glutamate receptor 5 (5a)
LigandBDBM222755
Substrate/Competitorn/a
Meas. Tech.Intracellular Ca2+ Mobilization Assay
Temperature310.15±n/a K
EC50 12±n/a nM
Commentsextracted
Citation Green, LGuba, WJaeschke, GJolidon, SLindemann, LRicci, ARueher, DStadler, HVieira, E Arlethynyl derivatives US Patent US9315498 Publication Date 4/19/2016
 
Isoform 1 of Metabotropic glutamate receptor 5 (5a)
Name:Isoform 1 of Metabotropic glutamate receptor 5 (5a)
Type:Enzyme
Mol. Mass.:128885.13
Organism:Homo sapiens (Human)
Description:P41594-2
Residue:1180
BDBM222755
NameBDBM222755
Synonyms:US9315498, 43
TypeSmall organic molecule
Emp. Form.C20H19FN2O
Mol. Mass.322.3761
SMILESCC1(C)CCC(=O)N(C1)c1ccc(cn1)C#Cc1cccc(F)c1