Reaction Details
TargetIsoform 1 of Metabotropic glutamate receptor 5 (5a)
LigandBDBM198910
Substrate/Competitorn/a
Meas. Tech.Intracellular Ca2+ Mobilization Assay
Temperature310.15±n/a K
EC50 10±n/a nM
Commentsextracted
Citation Green, LGuba, WJaeschke, GJolidon, SLindemann, LRicci, ARueher, DStadler, HVieira, E Arlethynyl derivatives US Patent US9315498 Publication Date 4/19/2016
 
Isoform 1 of Metabotropic glutamate receptor 5 (5a)
Name:Isoform 1 of Metabotropic glutamate receptor 5 (5a)
Type:Enzyme
Mol. Mass.:128885.13
Organism:Homo sapiens (Human)
Description:P41594-2
Residue:1180
BDBM198910
NameBDBM198910
Synonyms:US9221802, Ref. Ex. 72 | US9315498, 72
TypeSmall organic molecule
Emp. Form.C19H18N2O2
Mol. Mass.306.3584
SMILESCC1(C)CCN(C(=O)O1)c1ccc(cn1)C#Cc1ccccc1