Reaction Details
TargetIsoform 1 of Metabotropic glutamate receptor 5 (5a)
LigandBDBM222824
Substrate/Competitorn/a
Meas. Tech.Intracellular Ca2+ Mobilization Assay
Temperature310.15±n/a K
EC50 13±n/a nM
Commentsextracted
Citation Green, LGuba, WJaeschke, GJolidon, SLindemann, LRicci, ARueher, DStadler, HVieira, E Arlethynyl derivatives US Patent US9315498 Publication Date 4/19/2016
 
Isoform 1 of Metabotropic glutamate receptor 5 (5a)
Name:Isoform 1 of Metabotropic glutamate receptor 5 (5a)
Type:Enzyme
Mol. Mass.:128885.13
Organism:Homo sapiens (Human)
Description:P41594-2
Residue:1180
BDBM222824
NameBDBM222824
Synonyms:US9315498, 115
TypeSmall organic molecule
Emp. Form.C18H17N3O
Mol. Mass.291.3471
SMILESCC1(C)CN(C(=O)C1)c1ncc(cn1)C#Cc1ccccc1