Reaction Details
TargetIsoform 1 of Metabotropic glutamate receptor 5 (5a)
LigandBDBM222833
Substrate/Competitorn/a
Meas. Tech.Intracellular Ca2+ Mobilization Assay
Temperature310.15±n/a K
EC50 7±n/a nM
Commentsextracted
Citation Green, LGuba, WJaeschke, GJolidon, SLindemann, LRicci, ARueher, DStadler, HVieira, E Arlethynyl derivatives US Patent US9315498 Publication Date 4/19/2016
 
Isoform 1 of Metabotropic glutamate receptor 5 (5a)
Name:Isoform 1 of Metabotropic glutamate receptor 5 (5a)
Type:Enzyme
Mol. Mass.:128885.13
Organism:Homo sapiens (Human)
Description:P41594-2
Residue:1180
BDBM222833
NameBDBM222833
Synonyms:US9315498, 124
TypeSmall organic molecule
Emp. Form.C18H16F2N4O
Mol. Mass.342.3426
SMILESCN1C(=O)N(CC1(C)C)c1ncc(cn1)C#Cc1cc(F)ccc1F