Reaction Details
TargetIsoform 1 of Metabotropic glutamate receptor 5 (5a)
LigandBDBM222888
Substrate/Competitorn/a
Meas. Tech.Intracellular Ca2+ Mobilization Assay
Temperature310.15±n/a K
EC50 12±n/a nM
Commentsextracted
Citation Green, LGuba, WJaeschke, GJolidon, SLindemann, LRicci, ARueher, DStadler, HVieira, E Arlethynyl derivatives US Patent US9315498 Publication Date 4/19/2016
 
Isoform 1 of Metabotropic glutamate receptor 5 (5a)
Name:Isoform 1 of Metabotropic glutamate receptor 5 (5a)
Type:Enzyme
Mol. Mass.:128885.13
Organism:Homo sapiens (Human)
Description:P41594-2
Residue:1180
BDBM222888
NameBDBM222888
Synonyms:US9315498, 174
TypeSmall organic molecule
Emp. Form.C19H17FN4O
Mol. Mass.336.3629
SMILESCN1[C@H]2CCC[C@H]2N(C1=O)c1ccc(nn1)C#Cc1cccc(F)c1