Reaction Details
Target5'-nucleotidase
LigandBDBM223074
Substrate/Competitorn/a
Meas. Tech.Ecto-5'-Nucleotidase Inhibition Assay
pH7.4±n/a
Temperature310.15±n/a K
IC50 310±10.0 nM
Commentsextracted
Citation Channar, PAShah, SJHassan, SNisa, ZULecka, JSévigny, JBajorath, JSaeed, AIqbal, J Isonicotinohydrazones as inhibitors of alkaline phosphatase and ecto-5'-nucleotidase. Chem Biol Drug Des89:365-370 (2017) 
 
5'-nucleotidase
Name:5'-nucleotidase
Type:Enzyme
Mol. Mass.:63971.44
Organism:Rattus norvegicus (Rat)
Description:P21588
Residue:576
BDBM223074
NameBDBM223074
Synonyms:(E)-N'-(4'-Methoxybenzylidene)isonicotinohydrazide (3d)
TypeSmall organic molecule
Emp. Form.C14H13N3O2
Mol. Mass.255.2719
SMILESCOc1ccc(\C=N\NC(=O)c2ccncc2)cc1