Reaction Details
Target5'-nucleotidase
LigandBDBM223075
Substrate/Competitorn/a
Meas. Tech.Ecto-5'-Nucleotidase Inhibition Assay
pH7.4±n/a
Temperature310.15±n/a K
IC50 450±30 nM
Commentsextracted
Citation Channar, PAShah, SJHassan, SNisa, ZULecka, JSévigny, JBajorath, JSaeed, AIqbal, J Isonicotinohydrazones as inhibitors of alkaline phosphatase and ecto-5'-nucleotidase. Chem Biol Drug Des89:365-370 (2017) 
 
5'-nucleotidase
Name:5'-nucleotidase
Type:Enzyme
Mol. Mass.:63971.44
Organism:Rattus norvegicus (Rat)
Description:P21588
Residue:576
BDBM223075
NameBDBM223075
Synonyms:(E)-N'-(2'-hydroxybenzylidene)isonicotinohydrazide (3e)
TypeSmall organic molecule
Emp. Form.C13H11N3O2
Mol. Mass.241.2453
SMILESOc1ccccc1\C=N\NC(=O)c1ccncc1